{"text_format":"2","workbook":"xlsx","n_sheets":4,"sheets":["Instructions - MATCH","JCPG - Total Budget Summary","JCPG - Personnel","JCPG - Non-Personnel"],"not_rendered":{"charts":0,"images":0,"macros":0,"external_links":0,"defined_names":2,"comments":0,"pivot_tables":0},"unopened":[],"bounds":{"document_bytes":16777216,"sheet_cells":100000,"run_cost":"one","rows_first":2000,"rows_last":500,"rows_between":2000,"halvings":0,"cell_chars":16384,"cell_head_chars":4096},"cells_cut":0,"cells_raw":0,"read":"whole","date_system":"1900"}

{"sheet":"Instructions - MATCH","index":0,"n_rows":38,"n_cols":2,"rows_kept":38,"cut":false,"hidden":false,"merged":[[37,1,41,7],[0,3,0,5],[0,6,0,7],[2,1,21,7],[0,0,0,2],[23,1,23,2],[36,1,36,2],[24,1,34,7],[1,1,1,2]]}
["Instructions"]
[null,"Summary Tab"]
[null,"All cells containing a formula should be locked and will auto-fill from the personnel and non-personnel tabs. \n\n1. Fields containing red text should be filled in with agency information. \n2. The person completing the budget workbook should include their name and contact email. \n3. The \"Fiscal Check\" box should use the award amount being budgeted to double check that the information pulling into the summary tab is correct.\n\nNotes/Tips: \n- Do NOT copy/cut - paste information into or within the workbook. This may cause REF errors. \n- Errors are expected to be corrected by awardee completing budget workbook.  Methods to remove error: Undo until error is removed OR start again from last save point that did not have the error. \n- If a formula error presents itself that cannot be corrected by above methods, please reach out to KDOC Fiscal for assistance. \n- To print: select the area you wish to print and set the Print Area. \n     This can be found in Page Layout > Print Area > Set Print Area. \n     Within the print window, change orientation and scaling as needed.\n\nTo complete a grant matching budget, Applicants should recognize there are two tables on each tab. \nOne for the grant funded portion (teal colored table) and one for the matching contribution (orange table). \nEach table should be completed accordingly to show the full budget for the program. "]
{"$rows_empty":20}
[null,"Personnel Tab"]
[null,"This tab should be used for personnel that will be paid through the Grant Funding. \nIf contracting for care coordinator positions(s), that information should be entered in the Contractual Category section on the Non-Personnel tab. \n\n1. Enter the staff name, position description, and grant total wages in columns B through D. \n2. Please add the approprate percentages and amounts for each employee to have the correct benefits calculated out. \n3. Totals for each employee will be calculated in column X. \n4. Contracted staff that are not true employees (i.e. receiving a W-2 at year end) and should be recorded under non-personnel contractual. \n\nRepeat for Matching Funds in orange section"]
{"$rows_empty":11}
[null,"Non-Personnel Tab"]
[null,"In each section, use the line items provided to create the non-personnel budget.\n1. Please provide simple descriptions in column C. \n2. Make sure to include comments in the boxes to give detail about why these additional items are needed for the grant.\n\nRepeat for Matching Funds in orange section."]

{"sheet":"JCPG - Total Budget Summary","index":1,"n_rows":27,"n_cols":16,"rows_kept":27,"cut":false,"hidden":false,"merged":[[5,2,5,5],[1,7,1,9],[2,7,2,9],[5,7,5,10],[4,13,5,14],[2,13,2,14],[1,13,1,15]]}
[null,null,null,"FY2027"]
[null,null,null,"JCPG MATCHING FUNDS",null,null,"Completed by: ","Enter Name Here",{"$nulls":5},"FISCAL CHECK"]
[null,null,null,"Enter Agency Here",null,null,"Contact Email:","EMAIL",{"$nulls":5},"Allocation\n(Use amounts provided by KDOC) ",null,0]
[null,null,"Red Text fields can be altered"]
[null,null,"ALL CELLS BELOW THIS POINT AUTO-FILL.",{"$nulls":4},"ALL CELLS BELOW THIS POINT AUTO-FILL.",{"$nulls":5},"Budget \n(per this workbook)"]
[null,null,"JCPG BUDGET SUMMARY",{"$nulls":4},"MATCH BUDGET SUMMARY",{"$nulls":7},{"$f":"F27","v":0}]
[null,null,"PERSONNEL",{"$nulls":4},"PERSONNEL"]
[{"$nulls":4},"# of Employees/Positions","Admin",null,null,null,"# of Employees/Positions","Admin",null,null,null,"DIFF",{"$f":"P3-P6","v":0}]
[null,"1A","Salary",null,null,{"$f":"'JCPG - Personnel'!D2","v":0},"1A","Salary",null,null,{"$f":"'JCPG - Personnel'!AC2","v":0}]
[null,"1B","Benefits",null,null,{"$f":"'JCPG - Personnel'!D3","v":0},"1B","Benefits",null,null,{"$f":"'JCPG - Personnel'!AC3","v":0}]
[null,null,"Total Personnel Section",null,{"$f":"COUNTIF('JCPG - Personnel'!B9:B265,\"<>\")","v":0},{"$f":"ROUND(SUM(F9:F10),2)","v":0},null,"Total Personnel Section",null,{"$f":"COUNTIF('JCPG - Personnel'!AA9:AA265,\"<>\")","v":0},{"$f":"ROUND(SUM(K9:K10),2)","v":0}]
[]
[null,null,"NON-PERSONNEL",{"$nulls":4},"NON-PERSONNEL"]
[{"$nulls":5},"Admin",{"$nulls":4},"Admin"]
[null,"2A","Travel ",null,null,{"$f":"'JCPG - Non-Personnel'!D9","v":0},"2A","Travel ",null,null,{"$f":"'JCPG - Non-Personnel'!I9","v":0}]
[null,"2B","Training",null,null,{"$f":"'JCPG - Non-Personnel'!D24","v":0},"2B","Training",null,null,{"$f":"'JCPG - Non-Personnel'!I24","v":0}]
[null,"2C","Communication",null,null,{"$f":"'JCPG - Non-Personnel'!D38","v":0},"2C","Communication",null,null,{"$f":"'JCPG - Non-Personnel'!I38","v":0}]
[null,"2D","Equipment",null,null,{"$f":"'JCPG - Non-Personnel'!D52","v":0},"2D","Equipment",null,null,{"$f":"'JCPG - Non-Personnel'!I52","v":0}]
[null,"2E","Supplies/Commodities",null,null,{"$f":"'JCPG - Non-Personnel'!D66","v":0},"2E","Supplies/Commodities",null,null,{"$f":"'JCPG - Non-Personnel'!I66","v":0}]
[null,"2F","Facility",null,null,{"$f":"'JCPG - Non-Personnel'!D80","v":0},"2F","Facility",null,null,{"$f":"'JCPG - Non-Personnel'!I80","v":0}]
[null,"2G","Contractual",null,null,{"$f":"'JCPG - Non-Personnel'!D99","v":0},"2G","Contractual",null,null,{"$f":"'JCPG - Non-Personnel'!I99","v":0}]
[null,null,"Total Non-Personnel",null,null,{"$f":"SUM(F15:F21)","v":0},null,"Total Non-Personnel",null,null,{"$f":"SUM(K15:K21)","v":0}]
[]
[null,"3A","Total Contracts/Client Services",null,null,{"$f":"'JCPG - Non-Personnel'!D130","v":0},"3A","Total Contracts/Client Services",null,null,{"$f":"'JCPG - Non-Personnel'!I130","v":0}]
[]
[]
[null,null,"JCPG TOTAL",null,null,{"$f":"ROUND(F22+F11+F24,2)","v":0},null,"MATCH TOTAL",null,null,{"$f":"ROUND(K22+K11+K24,2)","v":0}]

{"sheet":"JCPG - Personnel","index":2,"n_rows":266,"n_cols":49,"rows_kept":266,"cut":false,"hidden":false,"merged":[[4,4,5,11],[6,4,6,12],[6,29,6,37],[5,25,5,28],[5,0,5,3],[4,29,5,36]]}
[null,{"$f":"'JCPG - Total Budget Summary'!D1","v":"FY2027"},"TOTALS AT A GLANCE","JCPG TOTALS",{"$nulls":23},"TOTALS AT A GLANCE","MATCH TOTALS"]
[null,{"$f":"'JCPG - Total Budget Summary'!D3","v":"Enter Agency Here"},"SALARY",{"$f":"D266","v":0},{"$nulls":23},"SALARY",{"$f":"AC266","v":0}]
[null,null,"BENEFITS",{"$f":"W266","v":0},{"$nulls":23},"BENEFITS",{"$f":"AV266","v":0}]
[null,null,null,{"$f":"SUM(D2:D3)","v":0},{"$nulls":24},{"$f":"SUM(AC2:AC3)","v":0}]
[{"$nulls":4},"RED NUMBERS CAN BE ALTERED\nPlease review all percentages and dollar amounts for each employee and update as needed. ",{"$nulls":24},"RED NUMBERS CAN BE ALTERED\nPlease review all percentages and dollar amounts for each employee and update as needed. "]
["JCPG FUNDS",{"$nulls":24},"MATCH FUNDS"]
[null,"1A PERSONNEL",null,null,"BENEFITS CALCULATIONS",{"$nulls":21},"1A PERSONNEL",null,null,"BENEFITS CALCULATIONS"]
[null,"Name ","Position Description","TOTAL SALARY","FICA \nSocial \nSecurity","FICA \nMedicare","KPERS \n(retirement)","State \nUnemployment","State \nWorkman's Comp","Health \nInsurance","Life \nInsurance","Other #1","Other #2","FICA\nSocial\nSecurity","FICA\nMedicare","KPERS\n(retirement)","State\nUnemployment","State\nWorkman's\nComp","Health\nInsurance","Life\nInsurance","Other #1","Other #2","Total Benefits","Total Per \nEmployee",null,null,"Name ","Position Description","TOTAL SALARY","FICA \nSocial \nSecurity","FICA \nMedicare","KPERS \n(retirement)","State \nUnemployment","State \nWorkman's Comp","Health \nInsurance","Life \nInsurance","Other #1","Other #2","FICA\nSocial\nSecurity","FICA\nMedicare","KPERS\n(retirement)","State\nUnemployment","State\nWorkman's\nComp","Health\nInsurance","Life\nInsurance","Other #1","Other #2","Total Benefits","Total Per \nEmployee"]
[{"$nulls":4},0,0,0,0,0,0,0,0,0,{"$f":"$D9*$E9","v":0},{"$f":"$F9*$D9","v":0},{"$f":"$D9*$G9","v":0},{"$f":"$D9*$H9","v":0},{"$f":"$D9*$I9","v":0},{"$f":"$J9","v":0},{"$f":"$K9","v":0},{"$f":"$L9","v":0},{"$f":"$M9","v":0},{"$f":"ROUND(SUM(N9:V9),2)","v":0},{"$f":"D9+W9","v":0},{"$nulls":5},0,0,0,0,0,0,0,0,0,{"$f":"$AC9*$AD9","v":0},{"$f":"$AC9*$AE9","v":0},{"$f":"$AC9*$AF9","v":0},{"$f":"$AC9*$AG9","v":0},{"$f":"$AC9*$AH9","v":0},{"$f":"$AI9","v":0},{"$f":"$AJ9","v":0},{"$f":"$AK9","v":0},{"$f":"$AL9","v":0},{"$f":"ROUND(SUM(AM9:AU9),2)","v":0},{"$f":"AC9+AV9","v":0}]
[{"$nulls":13},{"$f":"$D10*$E10","v":0},{"$f":"$F10*$D10","v":0},{"$f":"$D10*$G10","v":0},{"$f":"$D10*$H10","v":0},{"$f":"$D10*$I10","v":0},{"$f":"$J10","v":0},{"$f":"$K10","v":0},{"$f":"$L10","v":0},{"$f":"$M10","v":0},{"$f":"ROUND(SUM(N10:V10),2)","v":0},{"$f":"D10+W10","v":0},{"$nulls":14},{"$f":"$AC10*$AD10","v":0},{"$f":"$AC10*$AE10","v":0},{"$f":"$AC10*$AF10","v":0},{"$f":"$AC10*$AG10","v":0},{"$f":"$AC10*$AH10","v":0},{"$f":"$AI10","v":0},{"$f":"$AJ10","v":0},{"$f":"$AK10","v":0},{"$f":"$AL10","v":0},{"$f":"ROUND(SUM(AM10:AU10),2)","v":0},{"$f":"AC10+AV10","v":0}]
[{"$nulls":13},0,0,0,0,0,0,0,0,0,0,0,{"$nulls":14},0,0,0,0,0,0,0,0,0,0,0]
[{"$nulls":13},0,0,0,0,0,0,0,0,0,0,0,{"$nulls":14},0,0,0,0,0,0,0,0,0,0,0]
[{"$nulls":13},0,0,0,0,0,0,0,0,0,0,0,{"$nulls":14},0,0,0,0,0,0,0,0,0,0,0]
[{"$nulls":13},0,0,0,0,0,0,0,0,0,0,0,{"$nulls":14},0,0,0,0,0,0,0,0,0,0,0]
[{"$nulls":13},0,0,0,0,0,0,0,0,0,0,0,{"$nulls":14},0,0,0,0,0,0,0,0,0,0,0]
[{"$nulls":13},0,0,0,0,0,0,0,0,0,0,0,{"$nulls":14},0,0,0,0,0,0,0,0,0,0,0]
[{"$nulls":13},0,0,0,0,0,0,0,0,0,0,0,{"$nulls":14},0,0,0,0,0,0,0,0,0,0,0]
[{"$nulls":13},0,0,0,0,0,0,0,0,0,0,0,{"$nulls":14},0,0,0,0,0,0,0,0,0,0,0]
[{"$nulls":13},0,0,0,0,0,0,0,0,0,0,0,{"$nulls":14},0,0,0,0,0,0,0,0,0,0,0]
[{"$nulls":13},0,0,0,0,0,0,0,0,0,0,0,{"$nulls":14},0,0,0,0,0,0,0,0,0,0,0]
[{"$nulls":13},0,0,0,0,0,0,0,0,0,0,0,{"$nulls":14},0,0,0,0,0,0,0,0,0,0,0]
[{"$nulls":13},0,0,0,0,0,0,0,0,0,0,0,{"$nulls":14},0,0,0,0,0,0,0,0,0,0,0]
[{"$nulls":13},0,0,0,0,0,0,0,0,0,0,0,{"$nulls":14},0,0,0,0,0,0,0,0,0,0,0]
[{"$nulls":13},0,0,0,0,0,0,0,0,0,0,0,{"$nulls":14},0,0,0,0,0,0,0,0,0,0,0]
[{"$nulls":13},0,0,0,0,0,0,0,0,0,0,0,{"$nulls":14},0,0,0,0,0,0,0,0,0,0,0]
[{"$nulls":13},0,0,0,0,0,0,0,0,0,0,0,{"$nulls":14},0,0,0,0,0,0,0,0,0,0,0]
[{"$nulls":13},0,0,0,0,0,0,0,0,0,0,0,{"$nulls":14},0,0,0,0,0,0,0,0,0,0,0]
[{"$nulls":13},0,0,0,0,0,0,0,0,0,0,0,{"$nulls":14},0,0,0,0,0,0,0,0,0,0,0]
[{"$nulls":13},0,0,0,0,0,0,0,0,0,0,0,{"$nulls":14},0,0,0,0,0,0,0,0,0,0,0]
[{"$nulls":13},0,0,0,0,0,0,0,0,0,0,0,{"$nulls":14},0,0,0,0,0,0,0,0,0,0,0]
[{"$nulls":13},0,0,0,0,0,0,0,0,0,0,0,{"$nulls":14},0,0,0,0,0,0,0,0,0,0,0]
[{"$nulls":13},0,0,0,0,0,0,0,0,0,0,0,{"$nulls":14},0,0,0,0,0,0,0,0,0,0,0]
[{"$nulls":13},0,0,0,0,0,0,0,0,0,0,0,{"$nulls":14},0,0,0,0,0,0,0,0,0,0,0]
[{"$nulls":13},0,0,0,0,0,0,0,0,0,0,0,{"$nulls":14},0,0,0,0,0,0,0,0,0,0,0]
[{"$nulls":13},0,0,0,0,0,0,0,0,0,0,0,{"$nulls":14},0,0,0,0,0,0,0,0,0,0,0]
[{"$nulls":13},0,0,0,0,0,0,0,0,0,0,0,{"$nulls":14},0,0,0,0,0,0,0,0,0,0,0]
[{"$nulls":13},0,0,0,0,0,0,0,0,0,0,0,{"$nulls":14},0,0,0,0,0,0,0,0,0,0,0]
[{"$nulls":13},0,0,0,0,0,0,0,0,0,0,0,{"$nulls":14},0,0,0,0,0,0,0,0,0,0,0]
[{"$nulls":13},0,0,0,0,0,0,0,0,0,0,0,{"$nulls":14},0,0,0,0,0,0,0,0,0,0,0]
[{"$nulls":13},0,0,0,0,0,0,0,0,0,0,0,{"$nulls":14},0,0,0,0,0,0,0,0,0,0,0]
[{"$nulls":13},0,0,0,0,0,0,0,0,0,0,0,{"$nulls":14},0,0,0,0,0,0,0,0,0,0,0]
[{"$nulls":13},0,0,0,0,0,0,0,0,0,0,0,{"$nulls":14},0,0,0,0,0,0,0,0,0,0,0]
[{"$nulls":13},0,0,0,0,0,0,0,0,0,0,0,{"$nulls":14},0,0,0,0,0,0,0,0,0,0,0]
[{"$nulls":13},0,0,0,0,0,0,0,0,0,0,0,{"$nulls":14},0,0,0,0,0,0,0,0,0,0,0]
[{"$nulls":13},0,0,0,0,0,0,0,0,0,0,0,{"$nulls":14},0,0,0,0,0,0,0,0,0,0,0]
[{"$nulls":13},0,0,0,0,0,0,0,0,0,0,0,{"$nulls":14},0,0,0,0,0,0,0,0,0,0,0]
[{"$nulls":13},0,0,0,0,0,0,0,0,0,0,0,{"$nulls":14},0,0,0,0,0,0,0,0,0,0,0]
[{"$nulls":13},0,0,0,0,0,0,0,0,0,0,0,{"$nulls":14},0,0,0,0,0,0,0,0,0,0,0]
[{"$nulls":13},0,0,0,0,0,0,0,0,0,0,0,{"$nulls":14},0,0,0,0,0,0,0,0,0,0,0]
[{"$nulls":13},0,0,0,0,0,0,0,0,0,0,0,{"$nulls":14},0,0,0,0,0,0,0,0,0,0,0]
[{"$nulls":13},0,0,0,0,0,0,0,0,0,0,0,{"$nulls":14},0,0,0,0,0,0,0,0,0,0,0]
[null,null,"< open grouped cells for more lines",{"$nulls":10},0,0,0,0,0,0,0,0,0,{"$nulls":16},0,0,0,0,0,0,0,0,0]
[{"$nulls":13},0,0,0,0,0,0,0,0,0,0,0,{"$nulls":14},0,0,0,0,0,0,0,0,0,0,0]
[{"$nulls":13},0,0,0,0,0,0,0,0,0,0,0,{"$nulls":14},0,0,0,0,0,0,0,0,0,0,0]
[{"$nulls":13},0,0,0,0,0,0,0,0,0,0,0,{"$nulls":14},0,0,0,0,0,0,0,0,0,0,0]
[{"$nulls":13},0,0,0,0,0,0,0,0,0,0,0,{"$nulls":14},0,0,0,0,0,0,0,0,0,0,0]
[{"$nulls":13},0,0,0,0,0,0,0,0,0,0,0,{"$nulls":14},0,0,0,0,0,0,0,0,0,0,0]
[{"$nulls":13},0,0,0,0,0,0,0,0,0,0,0,{"$nulls":14},0,0,0,0,0,0,0,0,0,0,0]
[{"$nulls":13},0,0,0,0,0,0,0,0,0,0,0,{"$nulls":14},0,0,0,0,0,0,0,0,0,0,0]
[{"$nulls":13},0,0,0,0,0,0,0,0,0,0,0,{"$nulls":14},0,0,0,0,0,0,0,0,0,0,0]
[{"$nulls":13},0,0,0,0,0,0,0,0,0,0,0,{"$nulls":14},0,0,0,0,0,0,0,0,0,0,0]
[{"$nulls":13},0,0,0,0,0,0,0,0,0,0,0,{"$nulls":14},0,0,0,0,0,0,0,0,0,0,0]
[{"$nulls":13},0,0,0,0,0,0,0,0,0,0,0,{"$nulls":14},0,0,0,0,0,0,0,0,0,0,0]
[{"$nulls":13},0,0,0,0,0,0,0,0,0,0,0,{"$nulls":14},0,0,0,0,0,0,0,0,0,0,0]
[{"$nulls":13},0,0,0,0,0,0,0,0,0,0,0,{"$nulls":14},0,0,0,0,0,0,0,0,0,0,0]
[{"$nulls":13},0,0,0,0,0,0,0,0,0,0,0,{"$nulls":14},0,0,0,0,0,0,0,0,0,0,0]
[{"$nulls":13},0,0,0,0,0,0,0,0,0,0,0,{"$nulls":14},0,0,0,0,0,0,0,0,0,0,0]
[{"$nulls":13},0,0,0,0,0,0,0,0,0,0,0,{"$nulls":14},0,0,0,0,0,0,0,0,0,0,0]
[{"$nulls":13},0,0,0,0,0,0,0,0,0,0,0,{"$nulls":14},0,0,0,0,0,0,0,0,0,0,0]
[{"$nulls":13},0,0,0,0,0,0,0,0,0,0,0,{"$nulls":14},0,0,0,0,0,0,0,0,0,0,0]
[{"$nulls":13},0,0,0,0,0,0,0,0,0,0,0,{"$nulls":14},0,0,0,0,0,0,0,0,0,0,0]
[{"$nulls":13},0,0,0,0,0,0,0,0,0,0,0,{"$nulls":14},0,0,0,0,0,0,0,0,0,0,0]
[{"$nulls":13},0,0,0,0,0,0,0,0,0,0,0,{"$nulls":14},0,0,0,0,0,0,0,0,0,0,0]
[{"$nulls":13},{"$f":"$D74*$E74","v":0},{"$f":"$F74*$D74","v":0},{"$f":"$D74*$G74","v":0},{"$f":"$D74*$H74","v":0},{"$f":"$D74*$I74","v":0},{"$f":"$J74","v":0},{"$f":"$K74","v":0},{"$f":"$L74","v":0},{"$f":"$M74","v":0},{"$f":"ROUND(SUM(N74:V74),2)","v":0},{"$f":"D74+W74","v":0},{"$nulls":14},{"$f":"$AC74*$AD74","v":0},{"$f":"$AC74*$AE74","v":0},{"$f":"$AC74*$AF74","v":0},{"$f":"$AC74*$AG74","v":0},{"$f":"$AC74*$AH74","v":0},{"$f":"$AI74","v":0},{"$f":"$AJ74","v":0},{"$f":"$AK74","v":0},{"$f":"$AL74","v":0},{"$f":"ROUND(SUM(AM74:AU74),2)","v":0},{"$f":"AC74+AV74","v":0}]
[{"$nulls":13},0,0,0,0,0,0,0,0,0,0,0,{"$nulls":14},0,0,0,0,0,0,0,0,0,0,0]
[{"$nulls":13},0,0,0,0,0,0,0,0,0,0,0,{"$nulls":14},0,0,0,0,0,0,0,0,0,0,0]
[{"$nulls":13},0,0,0,0,0,0,0,0,0,0,0,{"$nulls":14},0,0,0,0,0,0,0,0,0,0,0]
[{"$nulls":13},0,0,0,0,0,0,0,0,0,0,0,{"$nulls":14},0,0,0,0,0,0,0,0,0,0,0]
[{"$nulls":13},0,0,0,0,0,0,0,0,0,0,0,{"$nulls":14},0,0,0,0,0,0,0,0,0,0,0]
[{"$nulls":13},0,0,0,0,0,0,0,0,0,0,0,{"$nulls":14},0,0,0,0,0,0,0,0,0,0,0]
[{"$nulls":13},0,0,0,0,0,0,0,0,0,0,0,{"$nulls":14},0,0,0,0,0,0,0,0,0,0,0]
[{"$nulls":13},0,0,0,0,0,0,0,0,0,0,0,{"$nulls":14},0,0,0,0,0,0,0,0,0,0,0]
[{"$nulls":13},0,0,0,0,0,0,0,0,0,0,0,{"$nulls":14},0,0,0,0,0,0,0,0,0,0,0]
[{"$nulls":13},0,0,0,0,0,0,0,0,0,0,0,{"$nulls":14},0,0,0,0,0,0,0,0,0,0,0]
[{"$nulls":13},0,0,0,0,0,0,0,0,0,0,0,{"$nulls":14},0,0,0,0,0,0,0,0,0,0,0]
[{"$nulls":13},0,0,0,0,0,0,0,0,0,0,0,{"$nulls":14},0,0,0,0,0,0,0,0,0,0,0]
[{"$nulls":13},0,0,0,0,0,0,0,0,0,0,0,{"$nulls":14},0,0,0,0,0,0,0,0,0,0,0]
[{"$nulls":13},0,0,0,0,0,0,0,0,0,0,0,{"$nulls":14},0,0,0,0,0,0,0,0,0,0,0]
[{"$nulls":13},0,0,0,0,0,0,0,0,0,0,0,{"$nulls":14},0,0,0,0,0,0,0,0,0,0,0]
[{"$nulls":13},0,0,0,0,0,0,0,0,0,0,0,{"$nulls":14},0,0,0,0,0,0,0,0,0,0,0]
[{"$nulls":13},0,0,0,0,0,0,0,0,0,0,0,{"$nulls":14},0,0,0,0,0,0,0,0,0,0,0]
[{"$nulls":13},0,0,0,0,0,0,0,0,0,{"$nulls":16},0,0,0,0,0,0,0,0,0]
[{"$nulls":13},0,0,0,0,0,0,0,0,0,0,0,{"$nulls":14},0,0,0,0,0,0,0,0,0,0,0]
[{"$nulls":13},0,0,0,0,0,0,0,0,0,0,0,{"$nulls":14},0,0,0,0,0,0,0,0,0,0,0]
[{"$nulls":13},0,0,0,0,0,0,0,0,0,0,0,{"$nulls":14},0,0,0,0,0,0,0,0,0,0,0]
[{"$nulls":13},0,0,0,0,0,0,0,0,0,0,0,{"$nulls":14},0,0,0,0,0,0,0,0,0,0,0]
[{"$nulls":13},0,0,0,0,0,0,0,0,0,0,0,{"$nulls":14},0,0,0,0,0,0,0,0,0,0,0]
[{"$nulls":13},0,0,0,0,0,0,0,0,0,0,0,{"$nulls":14},0,0,0,0,0,0,0,0,0,0,0]
[{"$nulls":13},0,0,0,0,0,0,0,0,0,0,0,{"$nulls":14},0,0,0,0,0,0,0,0,0,0,0]
[{"$nulls":13},0,0,0,0,0,0,0,0,0,0,0,{"$nulls":14},0,0,0,0,0,0,0,0,0,0,0]
[{"$nulls":13},0,0,0,0,0,0,0,0,0,0,0,{"$nulls":14},0,0,0,0,0,0,0,0,0,0,0]
[{"$nulls":13},0,0,0,0,0,0,0,0,0,0,0,{"$nulls":14},0,0,0,0,0,0,0,0,0,0,0]
[{"$nulls":13},0,0,0,0,0,0,0,0,0,0,0,{"$nulls":14},0,0,0,0,0,0,0,0,0,0,0]
[{"$nulls":13},0,0,0,0,0,0,0,0,0,0,0,{"$nulls":14},0,0,0,0,0,0,0,0,0,0,0]
[{"$nulls":13},0,0,0,0,0,0,0,0,0,0,0,{"$nulls":14},0,0,0,0,0,0,0,0,0,0,0]
[{"$nulls":13},0,0,0,0,0,0,0,0,0,0,0,{"$nulls":14},0,0,0,0,0,0,0,0,0,0,0]
[{"$nulls":13},0,0,0,0,0,0,0,0,0,0,0,{"$nulls":14},0,0,0,0,0,0,0,0,0,0,0]
[{"$nulls":13},0,0,0,0,0,0,0,0,0,0,0,{"$nulls":14},0,0,0,0,0,0,0,0,0,0,0]
[{"$nulls":13},0,0,0,0,0,0,0,0,0,0,0,{"$nulls":14},0,0,0,0,0,0,0,0,0,0,0]
[{"$nulls":13},0,0,0,0,0,0,0,0,0,0,0,{"$nulls":14},0,0,0,0,0,0,0,0,0,0,0]
[{"$nulls":13},0,0,0,0,0,0,0,0,0,0,0,{"$nulls":14},0,0,0,0,0,0,0,0,0,0,0]
[{"$nulls":13},0,0,0,0,0,0,0,0,0,0,0,{"$nulls":14},0,0,0,0,0,0,0,0,0,0,0]
[{"$nulls":13},0,0,0,0,0,0,0,0,0,0,0,{"$nulls":14},0,0,0,0,0,0,0,0,0,0,0]
[{"$nulls":13},0,0,0,0,0,0,0,0,0,0,0,{"$nulls":14},0,0,0,0,0,0,0,0,0,0,0]
[{"$nulls":13},0,0,0,0,0,0,0,0,0,0,0,{"$nulls":14},0,0,0,0,0,0,0,0,0,0,0]
[{"$nulls":13},0,0,0,0,0,0,0,0,0,0,0,{"$nulls":14},0,0,0,0,0,0,0,0,0,0,0]
[{"$nulls":13},0,0,0,0,0,0,0,0,0,0,0,{"$nulls":14},0,0,0,0,0,0,0,0,0,0,0]
[{"$nulls":13},0,0,0,0,0,0,0,0,0,0,0,{"$nulls":14},0,0,0,0,0,0,0,0,0,0,0]
[{"$nulls":13},0,0,0,0,0,0,0,0,0,0,0,{"$nulls":14},0,0,0,0,0,0,0,0,0,0,0]
[{"$nulls":13},0,0,0,0,0,0,0,0,0,0,0,{"$nulls":14},0,0,0,0,0,0,0,0,0,0,0]
{"$rows_left_out":147}
{"sheet":"JCPG - Non-Personnel","index":3,"n_rows":139,"n_cols":9,"rows_kept":139,"cut":false,"hidden":false,"merged":[[10,1,15,3],[2,1,2,2],[25,1,29,3],[39,1,45,3],[2,6,2,7],[10,6,15,8],[25,6,29,8],[39,6,45,8],[131,1,135,3],[108,1,109,3],[53,6,57,8],[67,6,71,8],[81,6,85,8],[100,6,104,8],[108,6,109,8],[131,6,135,8],[53,1,57,3],[67,1,71,3],[81,1,85,3],[100,1,104,3]]}
[null,{"$f":"'JCPG - Total Budget Summary'!D1","v":"FY2027"}]
[null,{"$f":"'JCPG - Total Budget Summary'!D3","v":"Enter Agency Here"}]
[null,"2 -  JCPG - AGENCY OPERATIONS",{"$nulls":4},"2 -  MATCH - AGENCY OPERATIONS"]
[null,"2 - A.  TRAVEL","Details/Description","Total Amount",null,null,"2 - A.  TRAVEL","Details/Description","Total Amount"]
[null,"Fuel and Mileage",{"$nulls":4},"Fuel and Mileage"]
[null,"K-Tag/Tolls/Parking",{"$nulls":4},"K-Tag/Tolls/Parking"]
[null,"Per Diem (includes Lodging)",{"$nulls":4},"Per Diem (includes Lodging)"]
[null,"Other #1",{"$nulls":4},"Other #1"]
[null,"TOTAL TRAVEL",null,{"$f":"SUM(D5:D8)","v":0},null,null,"TOTAL TRAVEL",null,{"$f":"SUM(I5:I8)","v":0}]
[null,"Comments: ",{"$nulls":4},"Comments: "]
{"$rows_empty":7}
[null,"2 - B.  TRAINING","Details/Description","Total Amount",null,null,"2 - B.  TRAINING","Details/Description","Total Amount"]
[null,"Fuel and Mileage",{"$nulls":4},"Fuel and Mileage"]
[null,"K-Tag/Tolls/Parking",{"$nulls":4},"K-Tag/Tolls/Parking"]
[null,"Registration",{"$nulls":4},"Registration"]
[null,"Per Diem (Includes Lodging)",{"$nulls":4},"Per Diem (Includes Lodging)"]
[null,"Other #1",{"$nulls":4},"Other #1"]
[null,"TOTAL TRAINING",null,{"$f":"SUM(D19:D23)","v":0},null,null,"TOTAL TRAINING",null,{"$f":"SUM(I19:I23)","v":0}]
[null,"Comments:",{"$nulls":4},"Comments:"]
[]
[]
[]
[]
[]
[]
[null,"2 - C. COMMUNICATION","Details/Description","Total Amount",null,null,"2 - C. COMMUNICATION","Details/Description","Total Amount"]
[null,"Cell Phone",{"$nulls":4},"Cell Phone"]
[null,"Internet Services",{"$nulls":4},"Internet Services"]
[null,"Land Line",{"$nulls":4},"Land Line"]
[null,"Other #1",{"$nulls":4},"Other #1"]
[null,"Other #2",{"$nulls":4},"Other #2"]
[null,"TOTAL COMMUNICAITON",null,{"$f":"SUM(D33:D37)","v":0},null,null,"TOTAL COMMUNICAITON",null,{"$f":"SUM(I33:I37)","v":0}]
[null,"Comments: ",{"$nulls":4},"Comments: "]
{"$rows_empty":8}
[null,"2 - D. EQUIPMENT","Details/Description","Total Amount",null,null,"2 - D. EQUIPMENT","Details/Description","Total Amount"]
[null,"Other #1",{"$nulls":4},"Other #1"]
[null,"Other #2",{"$nulls":4},"Other #2"]
[null,"Other #3",{"$nulls":4},"Other #3"]
[null,"TOTAL EQUIPMENT",null,{"$f":"SUM(D49:D51)","v":0},null,null,"TOTAL EQUIPMENT",null,{"$f":"SUM(I49:I51)","v":0}]
[null,"Comments:",{"$nulls":4},"Comments:"]
[]
[]
[]
[]
[]
[]
[null,"2 - E. SUPPLIES/COMMODITIES","Details/Description","Total Amount",null,null,"2 - E. SUPPLIES/COMMODITIES","Details/Description","Total Amount"]
[null,"Office Supplies",{"$nulls":4},"Office Supplies"]
[null,"Printing",{"$nulls":4},"Printing"]
[null,"Postage",{"$nulls":4},"Postage"]
[null,"Other #1",{"$nulls":4},"Other #1"]
[null,"Other #2",{"$nulls":4},"Other #2"]
[null,"TOTAL SUPPLIES/COMMODITIES",null,{"$f":"SUM(D61:D65)","v":0},null,null,"TOTAL SUPPLIES/COMMODITIES",null,{"$f":"SUM(I61:I65)","v":0}]
[null,"Comments:",{"$nulls":4},"Comments:"]
[]
[]
[]
[]
[]
[]
[null,"2 - F. FACILITY","Details/Description","Total Amount",null,null,"2 - F. FACILITY","Details/Description","Total Amount"]
[null,"Building Maintenance",{"$nulls":4},"Building Maintenance"]
[null,"Rent",{"$nulls":4},"Rent"]
[null,"Trash Service",{"$nulls":4},"Trash Service"]
[null,"Utilities",{"$nulls":4},"Utilities"]
[null,"Other #1",{"$nulls":4},"Other #1"]
[null,"TOTAL FACILITY",null,{"$f":"SUM(D75:D79)","v":0},null,null,"TOTAL FACILITY",null,{"$f":"SUM(I75:I79)","v":0}]
[null,"Comments:",{"$nulls":4},"Comments:"]
[]
[]
[]
[]
[]
[]
[null,"2 - G. CONTRACTUAL","Details/Description","Total Amount",null,null,"2 - G. CONTRACTUAL","Details/Description","Total Amount"]
[null,"Computer Maintenance",{"$nulls":4},"Computer Maintenance"]
[null,"Copier Maintenance",{"$nulls":4},"Copier Maintenance"]
[null,"Postage Meter Rental",{"$nulls":4},"Postage Meter Rental"]
[null,"Shredding",{"$nulls":4},"Shredding"]
[null,"Other #1",{"$nulls":4},"Other #1"]
[null,"Other #2",{"$nulls":4},"Other #2"]
[null,"Other #3",{"$nulls":4},"Other #3"]
[null,"Other #4",{"$nulls":4},"Other #4"]
[null,"Other #5",{"$nulls":4},"Other #5"]
[null,"Other #6",{"$nulls":4},"Other #6"]
[null,"TOTAL CONTRACTUAL",null,{"$f":"SUM(D89:D98)","v":0},null,null,"TOTAL CONTRACTUAL",null,{"$f":"SUM(I89:I98)","v":0}]
[null,"Comments:",{"$nulls":4},"Comments:"]
[]
[]
[]
[]
[]
[]
[null,"TOTAL OPERATIONS SECTION",null,{"$f":"D99+D80+D66+D52+D38+D24+D9","v":0},null,null,"TOTAL OPERATIONS SECTION",null,{"$f":"I99+I80+I66+I52+I38+I24+I9","v":0}]
[]
[null,"3. JCPG CONTRACTS/CLIENT SERVICES",{"$nulls":4},"3. JCPG CONTRACTS/CLIENT SERVICES"]
[]
[null,"3 - A. CONTRACTS/CLIENT SERVICES","Details/Description","Total Amount",null,null,"3 - A. CONTRACTS/CLIENT SERVICES","Details/Description","Total Amount"]
[null,"Academic Educaiton Services",{"$nulls":4},"Academic Educaiton Services"]
[null,"Cognitive Skills",{"$nulls":4},"Cognitive Skills"]
[null,"Drug Testing Services",{"$nulls":4},"Drug Testing Services"]
[null,"Drug Testing Supplies",{"$nulls":4},"Drug Testing Supplies"]
[null,"Electronic Monitoring Services",{"$nulls":4},"Electronic Monitoring Services"]
[null,"Housing Assistance",{"$nulls":4},"Housing Assistance"]
[null,"Subsistence",{"$nulls":4},"Subsistence"]
[null,"Surveillance Services",{"$nulls":4},"Surveillance Services"]
[null,"Transportation Assistance",{"$nulls":4},"Transportation Assistance"]
[null,"Vocational Education Services",{"$nulls":4},"Vocational Education Services"]
[null,"Other #1",{"$nulls":4},"Other #1"]
[null,"Other #2",{"$nulls":4},"Other #2"]
[null,"Other #3",{"$nulls":4},"Other #3"]
[null,"Other #4",{"$nulls":4},"Other #4"]
[null,"Other #5",{"$nulls":4},"Other #5"]
[null,"Other #6",{"$nulls":4},"Other #6"]
[null,"Other #7",{"$nulls":4},"Other #7"]
[null,"Other #8",{"$nulls":4},"Other #8"]
[null,"TOTAL CONTRACTS/CLIENT SERVICES",null,{"$f":"SUM(D112:D129)","v":0},null,null,"TOTAL CONTRACTS/CLIENT SERVICES",null,{"$f":"SUM(I112:I129)","v":0}]
[null,"Comments:",{"$nulls":4},"Comments:"]
{"$rows_empty":7}
[null,"TOTAL NON-PERSONNEL EXPENSES",null,{"$f":"D107+D130","v":0},null,null,"TOTAL NON-PERSONNEL EXPENSES",null,{"$f":"I107+I130","v":0}]